{"text_format":"2","workbook":"xlsx","n_sheets":3,"sheets":["Sheet1","Sheet2","Sheet3"],"not_rendered":{"charts":0,"images":0,"macros":0,"external_links":0,"defined_names":2,"comments":0,"pivot_tables":0},"unopened":[],"bounds":{"document_bytes":16777216,"sheet_cells":100000,"run_cost":"one","rows_first":2000,"rows_last":500,"rows_between":2000,"halvings":0,"cell_chars":16384,"cell_head_chars":4096},"cells_cut":0,"cells_raw":0,"read":"whole","date_system":"1900"}

{"sheet":"Sheet1","index":0,"n_rows":157,"n_cols":11,"rows_kept":157,"cut":false,"hidden":false,"merged":[[0,1,0,10]]}
[null,"2021年云川渝卡班招标线路需求表"]
[null,"本次报价不含税；公斤价含装车费，整车价不含装车费。"]
[null,2,3,3,3,null,3,2,4,4,7]
[null,"序号","始发地","途径地","目的地","车线","里程KM","时效MIN","仓位[方]","计价方式","集中使用时间段"]
[null,1,"昆明",null,"哈尔滨","昆明-哈尔滨",3778,3390,"不计方位","元/公斤","高峰使用"]
[null,2,"昆明",null,"长春","昆明-长春",3531,3225,"不计方位","元/公斤","高峰使用"]
[null,3,"昆明","长春","哈尔滨","昆明-长春-哈尔滨",3811,3495,"不计方位","元/公斤","高峰使用"]
[null,4,"昆明",null,"沈阳","昆明-沈阳",3252,2900,"不计方位","元/公斤","高峰使用"]
[null,5,"昆明",null,"盘锦","昆明-盘锦",3095,2785,"不计方位","元/公斤","高峰使用"]
[null,6,"昆明","盘锦","沈阳","昆明-盘锦-沈阳",3245,2940,"不计方位","元/公斤","高峰使用"]
[null,7,"昆明",null,"大连","昆明-大连",3372,3050,"不计方位","元/公斤","高峰使用"]
[null,8,"昆明",null,"北京","昆明-北京",2604,2340,"不计方位","元/公斤","高峰使用"]
[null,9,"昆明",null,"天津","昆明-天津",2601,2390,"不计方位","元/公斤","高峰使用"]
[null,10,"昆明",null,"太原","昆明-太原",2079,1875,"不计方位","元/公斤","高峰使用"]
[null,11,"昆明",null,"济南","昆明-济南",2316,2020,"不计方位","元/公斤","高峰使用"]
[null,12,"昆明",null,"青岛","昆明-青岛",2595,2385,"不计方位","元/公斤","高峰使用"]
[null,13,"昆明",null,"潍坊","昆明-潍坊",2505,2270,"不计方位","元/公斤","高峰使用"]
[null,14,"昆明","济南","潍坊","昆明-济南-潍坊",2497,2230,"不计方位","元/公斤","高峰使用"]
[null,15,"昆明",null,"东莞","昆明-东莞",1387,1250,"不计方位","元/公斤","高峰使用"]
[null,16,"昆明",null,"广州","昆明-广州",1363,1220,"不计方位","元/公斤","高峰使用"]
[null,17,"昆明",null,"佛山","昆明-佛山",1344,1230,"不计方位","元/公斤","高峰使用"]
[null,18,"昆明",null,"中山","昆明-中山",1325,1240,"不计方位","元/公斤","高峰使用"]
[null,19,"昆明",null,"深圳","昆明-深圳",1453,1320,"不计方位","元/公斤","高峰使用"]
[null,20,"昆明",null,"海口","昆明-海口",1210,1120,"不计方位","元/公斤","高峰使用"]
[null,21,"昆明",null,"南宁","昆明-南宁",775,785,"不计方位","元/公斤","高峰使用"]
[null,22,"昆明",null,"福州","昆明-福州",2053,1910,"不计方位","元/公斤","高峰使用"]
[null,23,"昆明","厦门","福州","昆明-厦门-福州",2210,2020,"不计方位","元/公斤","高峰使用"]
[null,24,"昆明",null,"晋江","昆明-晋江",2034,1770,"不计方位","元/公斤","高峰使用"]
[null,25,"昆明",null,"兰州","昆明-兰州",1689,1550,"不计方位","元/公斤","高峰使用"]
[null,26,"昆明",null,"西安","昆明-西安",1538,1485,"不计方位","元/公斤","高峰使用"]
[null,27,"昆明",null,"郑州","昆明-郑州",1910,1680,"不计方位","元/公斤","高峰使用"]
[null,28,"昆明",null,"武汉","昆明-武汉",1523,1440,"不计方位","元/公斤","高峰使用"]
[null,29,"昆明",null,"长沙","昆明-长沙",1368,1260,"不计方位","元/公斤","高峰使用"]
[null,30,"昆明",null,"南昌","昆明-南昌",1693,1560,"不计方位","元/公斤","高峰使用"]
[null,31,"昆明",null,"成都","昆明-成都",848,820,"不计方位","元/公斤","高峰使用"]
[null,32,"昆明",null,"重庆","昆明-重庆",874,840,"不计方位","元/公斤","高峰使用"]
[null,33,"昆明",null,"贵阳","昆明-贵阳",542,540,"不计方位","元/公斤","高峰使用"]
[null,34,"昆明",null,"南京","昆明-南京",2133,1935,"不计方位","元/公斤","高峰使用"]
[null,35,"昆明",null,"苏州","昆明-苏州",2296,2060,"不计方位","元/公斤","高峰使用"]
[null,36,"昆明","南京","苏州","昆明-南京-苏州",2308,2110,"不计方位","元/公斤","高峰使用"]
[null,37,"昆明",null,"合肥","昆明-合肥",1935,1780,"不计方位","元/公斤","高峰使用"]
[null,38,"昆明",null,"义乌","昆明-义乌",2067,1850,"不计方位","元/公斤","高峰使用"]
[null,39,"昆明",null,"台州","昆明-台州",2247,2040,"不计方位","元/公斤","高峰使用"]
[null,40,"昆明",null,"温州","昆明-温州",2215,1970,"不计方位","元/公斤","高峰使用"]
[null,41,"昆明",null,"宁波","昆明-宁波",2282,2060,"不计方位","元/公斤","高峰使用"]
[null,42,"昆明",null,"杭州","昆明-杭州",2251,1980,"不计方位","元/公斤","高峰使用"]
[null,43,"昆明",null,"上海","昆明-上海",2362,2090,"不计方位","元/公斤","高峰使用"]
[null,44,"昆明","杭州","上海","昆明-杭州-上海",2350,2125,"不计方位","元/公斤","高峰使用"]
[null,45,"昆明",null,"浦东","昆明-浦东",2363,2170,"不计方位","元/公斤","高峰使用"]
[null,46,"重庆",null,"哈尔滨","重庆-哈尔滨",3014,2740,"不计方位","元/公斤","高峰使用"]
[null,47,"重庆",null,"长春","重庆-长春",2661,2430,"不计方位","元/公斤","高峰使用"]
[null,48,"重庆",null,"沈阳","重庆-沈阳",2395,2200,"不计方位","元/公斤","高峰使用"]
[null,49,"重庆",null,"盘锦","重庆-盘锦",2257,2050,"不计方位","元/公斤","高峰使用"]
[null,50,"重庆",null,"北京","重庆-北京",1823,1610,"不计方位","元/公斤","高峰使用"]
[null,51,"重庆",null,"天津","重庆-天津",1826,1620,"不计方位","元/公斤","高峰使用"]
[null,52,"重庆",null,"太原","重庆-太原",1217,1140,"不计方位","元/公斤","高峰使用"]
[null,53,"重庆",null,"石家庄","重庆-石家庄",1575,1405,"不计方位","元/公斤","高峰使用"]
[null,54,"重庆",null,"济南","重庆-济南",1559,1370,"不计方位","元/公斤","高峰使用"]
[null,55,"重庆",null,"潍坊","重庆-潍坊",1732,1530,"不计方位","元/公斤","高峰使用"]
[null,56,"重庆",null,"东莞","重庆-东莞",1493,1360,"不计方位","元/公斤","高峰使用"]
[null,57,"重庆",null,"广州","重庆-广州",1421,1280,"不计方位","元/公斤","高峰使用"]
[null,58,"重庆",null,"中山","重庆-中山",1479,1335,"不计方位","元/公斤","高峰使用"]
[null,59,"重庆","广州","中山","重庆-广州-中山",1459,1410,"不计方位","元/公斤","高峰使用"]
[null,60,"重庆",null,"深圳","重庆-深圳",1548,1420,"不计方位","元/公斤","高峰使用"]
[null,61,"重庆",null,"南宁","重庆-南宁",994,905,"不计方位","元/公斤","高峰使用"]
[null,62,"重庆",null,"晋江","重庆-晋江",1740,1540,"不计方位","元/公斤","高峰使用"]
[null,63,"重庆",null,"兰州","重庆-兰州",991,915,"不计方位","元/公斤","高峰使用"]
[null,64,"重庆",null,"西安","重庆-西安",687,625,"不计方位","元/公斤","常年使用"]
[null,65,"重庆",null,"漯河","重庆-漯河",1067,980,"不计方位","元/公斤","高峰使用"]
[null,66,"重庆",null,"郑州","重庆-郑州",1155,1060,"不计方位","元/公斤","高峰使用"]
[null,67,"重庆",null,"武汉","重庆-武汉",855,830,"不计方位","元/公斤","高峰使用"]
[null,68,"重庆",null,"长沙","重庆-长沙",972,895,"不计方位","元/公斤","常年使用"]
[null,69,"重庆",null,"衡阳","重庆-衡阳",965,890,"不计方位","元/公斤","高峰使用"]
[null,70,"重庆",null,"南昌","重庆-南昌",1303,1210,"不计方位","元/公斤","高峰使用"]
[null,71,"重庆",null,"成都","重庆-成都",361,320,"不计方位","元/公斤","常年使用"]
[null,72,"重庆",null,"南充","重庆-南充",189,175,"不计方位","元/公斤","高峰使用"]
[null,73,"重庆",null,"自贡","重庆-自贡",238,230,"不计方位","元/公斤","高峰使用"]
[null,74,"重庆",null,"贵阳","重庆-贵阳",453,455,"不计方位","元/公斤","常年使用"]
[null,75,"重庆",null,"昆明","重庆-昆明",872,840,"不计方位","元/公斤","常年使用"]
[null,76,"重庆",null,"南京","重庆-南京",1436,1325,"不计方位","元/公斤","高峰使用"]
[null,77,"重庆",null,"淮安","重庆-淮安",1647,1470,"不计方位","元/公斤","高峰使用"]
[null,78,"重庆",null,"苏州","重庆-苏州",1603,1420,"不计方位","元/公斤","高峰使用"]
[null,79,"重庆",null,"常州","重庆-常州",1521,1390,"不计方位","元/公斤","高峰使用"]
[null,80,"重庆",null,"合肥","重庆-合肥",1275,1190,"不计方位","元/公斤","高峰使用"]
[null,81,"重庆",null,"蚌埠","重庆-蚌埠",1354,1255,"不计方位","元/公斤","高峰使用"]
[null,82,"重庆",null,"杭州","重庆-杭州",1673,1510,"不计方位","元/公斤","高峰使用"]
[null,83,"重庆","合肥","杭州","重庆-合肥-杭州",1693,1590,"不计方位","元/公斤","高峰使用"]
[null,84,"重庆",null,"嘉兴","重庆-嘉兴",1667,1530,"不计方位","元/公斤","高峰使用"]
[null,85,"重庆",null,"上海","重庆-上海",1673,1470,"不计方位","元/公斤","高峰使用"]
[null,86,"成都",null,"哈尔滨","成都-哈尔滨",3135,2790,"不计方位","元/公斤","常年使用"]
[null,87,"成都",null,"长春","成都-长春",2821,2525,"不计方位","元/公斤","常年使用"]
[null,88,"成都",null,"沈阳","成都-沈阳",2621,2315,"不计方位","元/公斤","常年使用"]
[null,89,"成都",null,"盘锦","成都-盘锦",2466,2215,"不计方位","元/公斤","常年使用"]
[null,90,"成都",null,"大连","成都-大连",2617,2400,"不计方位","元/公斤","高峰使用"]
[null,91,"成都",null,"北京","成都-北京",1976,1745,"不计方位","元/公斤","常年使用"]
[null,92,"成都",null,"天津","成都-天津",1965,1760,"不计方位","元/公斤","常年使用"]
[null,93,"成都",null,"呼和浩特","成都-呼和浩特",1712,1625,"不计方位","元/公斤","常年使用"]
[null,94,"成都",null,"太原","成都-太原",1329,1265,"不计方位","元/公斤","旺季使用"]
[null,95,"成都",null,"石家庄","成都-石家庄",1687,1490,"不计方位","元/公斤","旺季使用"]
[null,96,"成都",null,"保定","成都-保定",1862,1660,"不计方位","元/公斤","旺季使用"]
[null,97,"成都",null,"济南","成都-济南",1721,1560,"不计方位","元/公斤","旺季使用"]
[null,98,"成都",null,"青岛","成都-青岛",2007,1800,"不计方位","元/公斤","旺季使用"]
[null,99,"成都",null,"潍坊","成都-潍坊",1890,1690,"不计方位","元/公斤","旺季使用"]
[null,100,"成都",null,"济宁","成都-济宁",1511,1370,"不计方位","元/公斤","旺季使用"]
[null,101,"成都",null,"广州","成都-广州",1743,1510,"不计方位","元/公斤","旺季使用"]
[null,102,"成都",null,"佛山","成都-佛山",1760,1520,"不计方位","元/公斤","旺季使用"]
[null,103,"成都",null,"中山","成都-中山",1804,1610,"不计方位","元/公斤","旺季使用"]
[null,104,"成都",null,"揭阳","成都-揭阳",2106,1840,"不计方位","元/公斤","旺季使用"]
[null,105,"成都",null,"东莞","成都-东莞",1823,1605,"不计方位","元/公斤","旺季使用"]
[null,106,"成都",null,"深圳","成都-深圳",1874,1650,"不计方位","元/公斤","旺季使用"]
[null,107,"成都","东莞","深圳","成都-东莞-深圳",1704,1685,"不计方位","元/公斤","高峰使用"]
[null,108,"成都",null,"南宁","成都-南宁",1273,1150,"不计方位","元/公斤","旺季使用"]
[null,109,"成都",null,"柳州","成都-柳州",1169,1060,"不计方位","元/公斤","高峰使用"]
[null,110,"成都",null,"福州","成都-福州",2076,1970,"不计方位","元/公斤","旺季使用"]
[null,111,"成都",null,"晋江","成都-晋江",2071,1830,"不计方位","元/公斤","旺季使用"]
[null,112,"成都",null,"乌鲁木齐","成都-乌鲁木齐",2805,2580,"不计方位","元/公斤","常年使用"]
[null,113,"成都",null,"西宁","成都-西宁",1040,960,"不计方位","元/公斤","高峰使用"]
[null,114,"成都",null,"兰州","成都-兰州",1079,1050,"不计方位","元/公斤","旺季使用"]
[null,115,"成都",null,"银川","成都-银川",1259,1165,"不计方位","元/公斤","高峰使用"]
[null,116,"成都",null,"西安","成都-西安",771,815,"不计方位","元/公斤","常年使用"]
[null,117,"成都",null,"漯河","成都-漯河",1333,1235,"不计方位","元/公斤","旺季使用"]
[null,118,"成都",null,"郑州","成都-郑州",1293,1190,"不计方位","元/公斤","旺季使用"]
[null,119,"成都",null,"武汉","成都-武汉",1136,1120,"不计方位","元/公斤","常年使用"]
[null,120,"成都",null,"宜昌","成都-宜昌",840,770,"不计方位","元/公斤","高峰使用"]
[null,121,"成都",null,"长沙","成都-长沙",1278,1170,"不计方位","元/公斤","旺季使用"]
[null,122,"成都",null,"衡阳","成都-衡阳",1246,1155,"不计方位","元/公斤","高峰使用"]
[null,123,"成都",null,"南昌","成都-南昌",1533,1450,"不计方位","元/公斤","旺季使用"]
[null,124,"成都",null,"赣州","成都-赣州",1634,1500,"不计方位","元/公斤","高峰使用"]
[null,125,"成都",null,"重庆","成都-重庆",364,320,"不计方位","元/公斤","常年使用"]
[null,126,"成都",null,"南充","成都-南充",231,220,"不计方位","元/公斤","旺季使用"]
[null,127,"成都",null,"自贡","成都-自贡",190,180,"不计方位","元/公斤","旺季使用"]
[null,128,"成都",null,"贵阳","成都-贵阳",692,670,"不计方位","元/公斤","常年使用"]
[null,129,"成都",null,"昆明","成都-昆明",834,810,"不计方位","元/公斤","常年使用"]
[null,130,"成都",null,"南京","成都-南京",1718,1620,"不计方位","元/公斤","旺季使用"]
[null,131,"成都",null,"淮安","成都-淮安",1868,1690,"不计方位","元/公斤","旺季使用"]
[null,132,"成都",null,"徐州","成都-徐州",1576,1490,"不计方位","元/公斤","高峰使用"]
[null,133,"成都",null,"泰州","成都-泰州",1842,1680,"不计方位","元/公斤","高峰使用"]
[null,134,"成都",null,"南通","成都-南通",1926,1840,"不计方位","元/公斤","旺季使用"]
[null,135,"成都",null,"苏州","成都-苏州",1883,1695,"不计方位","元/公斤","旺季使用"]
[null,136,"成都",null,"常州","成都-常州",1821,1650,"不计方位","元/公斤","旺季使用"]
[null,137,"成都",null,"合肥","成都-合肥",1550,1470,"不计方位","元/公斤","旺季使用"]
[null,138,"成都",null,"芜湖","成都-芜湖",1658,1525,"不计方位","元/公斤","高峰使用"]
[null,139,"成都",null,"蚌埠","成都-蚌埠",1620,1520,"不计方位","元/公斤","高峰使用"]
[null,140,"成都",null,"台州","成都-台州",2049,1820,"不计方位","元/公斤","旺季使用"]
[null,141,"成都",null,"杭州","成都-杭州",1933,1780,"不计方位","元/公斤","旺季使用"]
[null,142,"成都",null,"宁波","成都-宁波",2071,1950,"不计方位","元/公斤","旺季使用"]
[null,143,"成都",null,"嘉兴","成都-嘉兴",2007,1815,"不计方位","元/公斤","高峰使用"]
[null,144,"成都",null,"上海","成都-上海",1958,1770,"不计方位","元/公斤","旺季使用"]
[null,145,"成都",null,"浦东","成都-浦东",2030,1840,"不计方位","元/公斤","旺季使用"]
[null,146,"南充",null,"广州","南充-广州",1498,1345,"不计方位","元/公斤","高峰使用"]
[null,147,"南充",null,"武汉","南充-武汉",943,870,"不计方位","元/公斤","高峰使用"]
[null,148,"南充",null,"成都","南充-成都",231,220,"不计方位","元/公斤","高峰使用"]
[null,149,"自贡",null,"广州","自贡-广州",1595,1405,"不计方位","元/公斤","高峰使用"]
[null,150,"自贡",null,"成都","自贡-成都",190,180,"不计方位","元/公斤","高峰使用"]
[null,151,"自贡",null,"重庆","自贡-重庆",238,230,"不计方位","元/公斤","高峰使用"]
[null,152,"自贡",null,"义乌","自贡-义乌",1791,1670,"不计方位","元/公斤","高峰使用"]
[null,153,"自贡",null,"杭州","自贡-杭州",1881,1700,"不计方位","元/公斤","高峰使用"]

{"sheet":"Sheet2","index":1,"n_rows":24,"n_cols":9,"rows_kept":24,"cut":false,"hidden":true,"merged":[]}
[{"$nulls":4},1,2,1,2,"合计"]
["义乌-盘锦-大连","义乌","盘锦","大连","义乌-盘锦","盘锦-大连",1615,310,{"$f":"G2+H2","v":1925}]
["义乌-盘锦-哈尔滨","义乌","盘锦","哈尔滨","义乌-盘锦","盘锦-哈尔滨",1615,670,{"$f":"G3+H3","v":2285}]
["义乌-盘锦-沈阳","义乌","盘锦","沈阳","义乌-盘锦","盘锦-沈阳",1615,185,1800]
["义乌-沈阳-哈尔滨","义乌","沈阳","哈尔滨","义乌-沈阳","沈阳-哈尔滨",1865,580,2445]
["义乌-天津-北京","义乌","天津","北京","义乌-天津","天津-北京",1295,115,1410]
["义乌-佛山-深圳","义乌","佛山","深圳","义乌-佛山","佛山-深圳",1130,150,1280]
["义乌-广州-佛山","义乌","广州","佛山","义乌-广州","广州-佛山",975,135,1110]
["义乌-深圳-佛山","义乌","深圳","佛山","义乌-深圳","深圳-佛山",1030,135,1165]
["义乌-兰州-西宁","义乌","兰州","西宁","义乌-兰州","兰州-西宁",1910,310,2220]
["义乌-漯河-郑州","义乌","漯河","郑州","义乌-漯河","漯河-郑州",865,135,1000]
["义乌-福州-晋江","义乌","福州","晋江","义乌-福州","福州-晋江",520,170,690]
["义乌-重庆-成都","义乌","重庆","成都","义乌-重庆","重庆-成都",1415,320,1735]
["义乌-贵阳-昆明","义乌","贵阳","昆明","义乌-贵阳","贵阳-昆明",1440,550,1990]
["台州-长春-哈尔滨","台州","长春","哈尔滨","台州-长春","长春-哈尔滨",1990,330,2320]
["台州-沈阳-长春","台州","沈阳","长春","台州-沈阳","沈阳-长春",1785,330,2115]
["台州-广州-中山","台州","广州","中山","台州-广州","广州-中山",1200,140,1340]
["台州-深圳-中山","台州","深圳","中山","台州-深圳","深圳-中山",1200,155,1355]
["台州-东莞-中山","台州","东莞","中山","台州-东莞","东莞-中山",1180,80,1260]
["台州-漯河-郑州","台州","漯河","郑州","台州-漯河","漯河-郑州",985,135,1120]
["台州-重庆-成都","台州","重庆","成都","台州-重庆","重庆-成都",1680,320,2000]
["台州-贵阳-昆明","台州","贵阳","昆明","台州-贵阳","贵阳-昆明",1650,550,2200]
["温州-长春-哈尔滨","温州","长春","哈尔滨","温州-长春","长春-哈尔滨",2040,330,2370]
["温州-天津-北京","温州","天津","北京","温州-天津","天津-北京",1320,115,1435]

{"sheet":"Sheet3","index":2,"n_rows":39,"n_cols":8,"rows_kept":39,"cut":false,"hidden":true,"merged":[]}
["车线类型","车线编码","车线名称","里程数(km)","车线名称",null,null,"里程数(km)"]
["对开车线A->B","200898015","广州ZZ-三亚YD(一班车/回货补助)",900,"广州-三亚",{"$f":"VLOOKUP(E2,Sheet1!$G$47:$G$68,2,0)","v":{"$error":"#N/A"}},{"$f":"D2-F2","v":{"$error":"#N/A"}},900]
["线路A-B","200240018","广州ZZ-盘锦ZZ-沈阳ZZ(卡班车)",2730,"广州-盘锦-沈阳",{"$f":"VLOOKUP(E3,Sheet1!$G$47:$G$68,2,0)","v":{"$error":"#N/A"}},{"$f":"D3-F3","v":{"$error":"#N/A"}},2730]
["线路A-B","200280025","广州ZZ-重庆ZZ-成都ZZ(卡班车)",1656,"广州-重庆-成都",{"$f":"VLOOKUP(E4,Sheet1!$G$47:$G$68,2,0)","v":{"$error":"#N/A"}},{"$error":"#N/A"},1656]
["线路A-B","200898024","广州ZZ-三亚YD(卡班车)",900,"广州-三亚",{"$f":"VLOOKUP(E5,Sheet1!$G$47:$G$68,2,0)","v":{"$error":"#N/A"}},{"$error":"#N/A"},900]
["线路A-B","200517014","广州ZZ-南京ZZ-淮安ZZ(卡班车)",1563,"广州-南京-淮安",{"$f":"VLOOKUP(E6,Sheet1!$G$47:$G$68,2,0)","v":{"$error":"#N/A"}},{"$error":"#N/A"},1563]
["线路A-B","754427002","广东揭阳ZZ-盘锦ZZ(卡班车)",2521,"揭阳-盘锦",{"$f":"VLOOKUP(E7,Sheet1!$G$47:$G$68,2,0)","v":{"$error":"#N/A"}},{"$error":"#N/A"},2521]
["线路A-B","200532012","广州ZZ-潍坊ZZ-青岛ZZ(卡班车)",2028,"广州-潍坊-青岛",{"$f":"VLOOKUP(E8,Sheet1!$G$47:$G$68,2,0)","v":{"$error":"#N/A"}},{"$error":"#N/A"},2028]
["线路A-B","769427005","东莞ZZ-盘锦ZZ(卡班车)",2678,"东莞-盘锦",{"$f":"VLOOKUP(E9,Sheet1!$G$47:$G$68,2,0)","v":{"$error":"#N/A"}},{"$error":"#N/A"},2678]
["线路A-B","769240011","东莞ZZ-沈阳ZZ(卡班车)",2816,"东莞-沈阳",{"$f":"VLOOKUP(E10,Sheet1!$G$47:$G$68,2,0)","v":{"$error":"#N/A"}},{"$error":"#N/A"},2816]
["对开车线B->A","573523008","杭州ZZ-泰州ZZ(整车计重二班车)",294,"杭州-泰州",{"$f":"VLOOKUP(E11,Sheet1!$G$47:$G$68,2,0)","v":{"$error":"#N/A"}},{"$error":"#N/A"},294]
["线路A-B","769451007","东莞ZZ-哈尔滨ZZ(卡班车)",3346,"东莞-哈尔滨",{"$f":"VLOOKUP(E12,Sheet1!$G$47:$G$68,2,0)","v":{"$error":"#N/A"}},{"$error":"#N/A"},3346]
["线路A-B","769431006","东莞ZZ-长春ZZ(卡班车)",3102,"东莞-长春",{"$f":"VLOOKUP(E13,Sheet1!$G$47:$G$68,2,0)","v":{"$error":"#N/A"}},{"$error":"#N/A"},3102]
["线路A-B","663451004","广东揭阳ZZ-长春ZZ-哈尔滨ZZ(卡班车)",3203,"揭阳-长春-哈尔滨",{"$f":"VLOOKUP(E14,Sheet1!$G$47:$G$68,2,0)","v":{"$error":"#N/A"}},{"$error":"#N/A"},3203]
["线路A-B","757431005","佛山ZZ-长春ZZ(卡班车)",3080,"佛山-长春",{"$f":"VLOOKUP(E15,Sheet1!$G$47:$G$68,2,0)","v":{"$error":"#N/A"}},{"$error":"#N/A"},3080]
["线路A-B","200395013","佛山ZZ-漯河ZZ(卡班车)",1353,"佛山-漯河",{"$f":"VLOOKUP(E16,Sheet1!$G$47:$G$68,2,0)","v":{"$error":"#N/A"}},{"$error":"#N/A"},1353]
["线路A-B","200591020","佛山ZZ-福州ZZ(卡班车)",891,"佛山-福州",{"$f":"VLOOKUP(E17,Sheet1!$G$47:$G$68,2,0)","v":{"$error":"#N/A"}},{"$error":"#N/A"},891]
["线路A-B","754536006","广东揭阳ZZ-青岛ZZ-潍坊ZZ(卡班车)",1893,"揭阳-青岛-潍坊",{"$f":"VLOOKUP(E18,Sheet1!$G$47:$G$68,2,0)","v":{"$error":"#N/A"}},{"$error":"#N/A"},1893]
["线路A-B","200280023","佛山ZZ-重庆ZZ-成都ZZ(卡班车)",1663,"佛山-重庆-成都",{"$f":"VLOOKUP(E19,Sheet1!$G$47:$G$68,2,0)","v":{"$error":"#N/A"}},{"$error":"#N/A"},1663]
["线路A-B","757791008","佛山ZZ-赣州ZZ-南昌ZZ(卡班车)",847,"佛山-赣州-南昌",{"$f":"VLOOKUP(E20,Sheet1!$G$47:$G$68,2,0)","v":{"$error":"#N/A"}},{"$error":"#N/A"},847]
["线路A-B","754574005","广东揭阳ZZ-宁波ZZ(卡班车)",1099,"揭阳-宁波",{"$f":"VLOOKUP(E21,Sheet1!$G$47:$G$68,2,0)","v":{"$error":"#N/A"}},{"$error":"#N/A"},1099]
["线路A-B","754210013","广东揭阳ZZ-杭州ZZ-上海ZZ(卡班车)",1099,"揭阳-杭州-上海",{"$f":"VLOOKUP(E22,Sheet1!$G$47:$G$68,2,0)","v":{"$error":"#N/A"}},{"$error":"#N/A"},1099]
["线路A-B","754991001","广东揭阳ZZ-乌鲁木齐ZZ(卡班车)",4319,"揭阳-乌鲁木齐",{"$f":"VLOOKUP(E23,Sheet1!$G$47:$G$68,2,0)","v":{"$error":"#N/A"}},{"$error":"#N/A"},4319]
["线路A-B","754931001","广东揭阳ZZ-兰州ZZ(卡班车)",2374,"揭阳-兰州",{"$f":"VLOOKUP(E24,Sheet1!$G$47:$G$68,2,0)","v":{"$error":"#N/A"}},{"$error":"#N/A"},2374]
["线路A-B","754280004","广东揭阳ZZ-重庆ZZ-成都ZZ(卡班车)",2009,"揭阳-重庆-成都",{"$f":"VLOOKUP(E25,Sheet1!$G$47:$G$68,2,0)","v":{"$error":"#N/A"}},{"$error":"#N/A"},2009]
["线路A-B","663512006","广东揭阳ZZ-杭州ZZ-苏州ZZ(卡班车)",1264,"揭阳-杭州-苏州",{"$f":"VLOOKUP(E26,Sheet1!$G$47:$G$68,2,0)","v":{"$error":"#N/A"}},{"$error":"#N/A"},1264]
["线路A-B","769471002","东莞ZZ-呼和浩特ZZ(卡班车)",2365,"东莞-呼和浩特",{"$f":"VLOOKUP(E27,Sheet1!$G$47:$G$68,2,0)","v":{"$error":"#N/A"}},{"$error":"#N/A"},2365]
["线路A-B","769210014","东莞ZZ-浦东ZZ(卡班车)",1467,"东莞-浦东",{"$f":"VLOOKUP(E28,Sheet1!$G$47:$G$68,2,0)","v":{"$error":"#N/A"}},{"$error":"#N/A"},1467]
["线路A-B","757517003","佛山ZZ-淮安ZZ(卡班车)",1572,"佛山-淮安",{"$f":"VLOOKUP(E29,Sheet1!$G$47:$G$68,2,0)","v":{"$error":"#N/A"}},{"$error":"#N/A"},1572]
["线路A-B","757797001","佛山ZZ-赣州ZZ(卡班车)",456,"佛山-赣州",{"$f":"VLOOKUP(E30,Sheet1!$G$47:$G$68,2,0)","v":{"$error":"#N/A"}},{"$error":"#N/A"},456]
["线路A-B","663797002","广东揭阳ZZ-赣州ZZ(卡班车)",426,"揭阳-赣州",{"$f":"VLOOKUP(E31,Sheet1!$G$47:$G$68,2,0)","v":{"$error":"#N/A"}},{"$error":"#N/A"},426]
["线路A-B","757734001","佛山ZZ-衡阳ZZ(卡班车)",547,"佛山-衡阳",{"$f":"VLOOKUP(E32,Sheet1!$G$47:$G$68,2,0)","v":{"$error":"#N/A"}},{"$error":"#N/A"},547]
["线路A-B","573551029","杭州ZZ-合肥ZZ(整车计重一班车)(单向挂车)",450,"杭州-合肥",{"$f":"VLOOKUP(E33,Sheet1!$G$47:$G$68,2,0)","v":{"$error":"#N/A"}},{"$error":"#N/A"},450]
["线路A-B","769513003","东莞ZZ-南通ZZ(卡班车)",1503,"东莞-南通",{"$f":"VLOOKUP(E34,Sheet1!$G$47:$G$68,2,0)","v":{"$error":"#N/A"}},{"$error":"#N/A"},1503]
["线路A-B","757574004","佛山ZZ-宁波ZZ(卡班车)",1385,"佛山-宁波",{"$f":"VLOOKUP(E35,Sheet1!$G$47:$G$68,2,0)","v":{"$error":"#N/A"}},{"$error":"#N/A"},1385]
["线路A-B","757451006","佛山ZZ-哈尔滨ZZ(卡班车)",3324,"佛山-哈尔滨",{"$f":"VLOOKUP(E36,Sheet1!$G$47:$G$68,2,0)","v":{"$error":"#N/A"}},{"$error":"#N/A"},3324]
["线路A-B","757553001","佛山ZZ-芜湖ZZ(卡班车)",1307,"佛山-芜湖",{"$f":"VLOOKUP(E37,Sheet1!$G$47:$G$68,2,0)","v":{"$error":"#N/A"}},{"$error":"#N/A"},1307]
["对开车线B->A","200871030","广州ZZ-昆明ZZ(整车计重四班车)",1353,"广州-昆明",{"$f":"VLOOKUP(E38,Sheet1!$G$47:$G$68,2,0)","v":{"$error":"#N/A"}},{"$error":"#N/A"},1353]
["对开车线A->B","871200020","昆明ZZ-广州ZZ(整车计重四班车)",1363,"昆明-广州",{"$f":"VLOOKUP(E39,Sheet1!$G$47:$G$68,2,0)","v":{"$error":"#N/A"}},{"$error":"#N/A"},1363]